{"text_format":"1","workbook":"xlsx","n_sheets":8,"sheets":["0","01","02","03","04","Sheet1","номенклатури","Sheet3"],"not_rendered":{"charts":0,"images":2,"macros":1,"external_links":0,"defined_names":15,"comments":1,"pivot_tables":0},"unopened":[],"bounds":{"document_bytes":16777216,"sheet_cells":100000,"rows_first":2000,"rows_last":500,"rows_between":2000,"halvings":0,"cell_chars":16384,"cell_head_chars":4096},"cells_cut":0,"cells_raw":0,"read":"whole","date_system":"1900"}

{"sheet":"0","index":0,"n_rows":14,"n_cols":3,"rows_kept":14,"cut":false,"hidden":false,"merged":[[5,0,5,3],[0,0,0,1]]}
["ЕДИННА ЕЛЕКТРОННА ОТЧЕТНА ФОРМА",null,{"$f":"IF(COUNTIFS(C9:D11,\"Грешка\")>0,\"Грешно попълнен отчет\",\"\")","v":""}]
["2020-06-30"]
["ЕИК"]
["………………","ЕЕОФ общински ЛЗБП версия 2.0 2020г"]
["Наименование на лечебното заведение:"]
[{"$f":"VLOOKUP(A4,номенклатури!$J$1:$K$122,2,0)","v":"Лечебно заведение"}]
[{"$f":"IF(MONTH(A2)=12,\"СПИСЪК НА ПРИЛОЖЕНИТЕ ОТЧЕТНИ ФОРМИ КЪМ ГОДИШЕН ФИНАНСОВ ОТЧЕТ\",\"СПИСЪК НА ПРИЛОЖЕНИТЕ ОТЧЕТНИ ФОРМИ КЪМ МЕЖДИНЕН ФИНАНСОВ ОТЧЕТ\")","v":"СПИСЪК НА ПРИЛОЖЕНИТЕ ОТЧЕТНИ ФОРМИ КЪМ МЕЖДИНЕН ФИНАНСОВ ОТЧЕТ"}]
[null,{"$f":"'01'!D1","v":"Т01 ОТЧЕТ ЗА ФИНАНСОВОТО СЪСТОЯНИЕ НА Лечебно заведение КЪМ 30-06-2020"}]
[null,{"$f":"'02'!D1","v":"Т02 РЕКАПИТУЛАЦИЯ НА ЗАДЪЛЖЕНИИЯТА НА Лечебно заведение КЪМ 30-06-2020"}]
[null,{"$f":"'03'!D1","v":"Т03 СПРАВКА ЗА ПЕРСОНАЛА НА Лечебно заведение ОТ 01-01-2020 ДО 30-06-2020"}]
[null,{"$f":"'04'!D1","v":"Т04 МЕДИКОСТАТИСТИЧЕСКИ И ФИНАНСОВИ ПОКАЗАТЕЛИ ЗА ДЕЙНОСТТА НА СТАЦИОНАРА НА Лечебно заведение ОТ 01-01-2020 ДО 30-06-2020"}]
[]
[]
["Електронен подпис"]

{"sheet":"01","index":1,"n_rows":31,"n_cols":11,"rows_kept":31,"cut":false,"hidden":false,"merged":[[0,3,0,6]]}
[{"$f":"'0'!$A$4","v":"………………"},{"$f":"'0'!$A$2","v":"2020-06-30"},"Т02",{"$f":"\"Т01 ОТЧЕТ ЗА ФИНАНСОВОТО СЪСТОЯНИЕ НА \"&'0'!A6&\" КЪМ \"&TEXT(B1,\"DD-MM-YYYY\")","v":"Т01 ОТЧЕТ ЗА ФИНАНСОВОТО СЪСТОЯНИЕ НА Лечебно заведение КЪМ 30-06-2020"},null,null,null,"Код","В лева",{"$f":"COUNTBLANK(I4:I30)","v":0},{"$f":"IF(ROUND(I4-I15,2)=0,\"OK\",\"Неравнен баланс\")","v":"OK"}]
[{"$f":"'0'!$A$4","v":"………………"},{"$f":"'0'!$A$2","v":"2020-06-30"},"Т02"]
[{"$f":"'0'!$A$4","v":"………………"},{"$f":"'0'!$A$2","v":"2020-06-30"},"Т02"]
[{"$f":"'0'!$A$4","v":"………………"},{"$f":"'0'!$A$2","v":"2020-06-30"},"Т02","00","00","01","АКТИВИ",{"$f":"D4&E4&F4","v":"000001"},{"$f":"I5+I9+I14","v":0}]
[{"$f":"'0'!$A$4","v":"………………"},{"$f":"'0'!$A$2","v":"2020-06-30"},"Т02","01","00","00","Нетекущи активи","010000",{"$f":"SUM(I6:I8)","v":0}]
[{"$f":"'0'!$A$4","v":"………………"},{"$f":"'0'!$A$2","v":"2020-06-30"},"Т02","01","01","00","Имоти, машини и оборудване","010100",0]
[{"$f":"'0'!$A$4","v":"………………"},{"$f":"'0'!$A$2","v":"2020-06-30"},"Т02","01","02","00","Нематериални активи","010200",0]
[{"$f":"'0'!$A$4","v":"………………"},{"$f":"'0'!$A$2","v":"2020-06-30"},"Т02","01","03","00","Инвестиции в дъщерни предприятия","010300",0]
[{"$f":"'0'!$A$4","v":"………………"},{"$f":"'0'!$A$2","v":"2020-06-30"},"Т02","02","00","00","Текущи активи","020000",{"$f":"SUM(I10:I13)","v":0}]
[{"$f":"'0'!$A$4","v":"………………"},{"$f":"'0'!$A$2","v":"2020-06-30"},"Т02","02","01","00","Материални запаси","020100",0]
[{"$f":"'0'!$A$4","v":"………………"},{"$f":"'0'!$A$2","v":"2020-06-30"},"Т02","02","02","00","Търговски и други вземания","020200",0]
[{"$f":"'0'!$A$4","v":"………………"},{"$f":"'0'!$A$2","v":"2020-06-30"},"Т02","02","05","00","Други вземания","020500",0]
[{"$f":"'0'!$A$4","v":"………………"},{"$f":"'0'!$A$2","v":"2020-06-30"},"Т02","02","03","00","Парични средства","020300",0]
[{"$f":"'0'!$A$4","v":"………………"},{"$f":"'0'!$A$2","v":"2020-06-30"},"Т02","14","00","00","Разходи за бъдещи периоди",{"$f":"D14&E14&F14","v":"140000"},0]
[{"$f":"'0'!$A$4","v":"………………"},{"$f":"'0'!$A$2","v":"2020-06-30"},"Т02","00","00","02","СОБСТВЕН КАПИТАЛ И ПАСИВИ",{"$f":"D15&E15&F15","v":"000002"},{"$f":"I16+I22+I25+I31","v":0}]
[{"$f":"'0'!$A$4","v":"………………"},{"$f":"'0'!$A$2","v":"2020-06-30"},"Т02","00","00","03","СОБСТВЕН КАПИТАЛ","000003",{"$f":"SUM(I17:I19)","v":0}]
[{"$f":"'0'!$A$4","v":"………………"},{"$f":"'0'!$A$2","v":"2020-06-30"},"Т02","03","00","00","Основен капитал","030000",0]
[{"$f":"'0'!$A$4","v":"………………"},{"$f":"'0'!$A$2","v":"2020-06-30"},"Т02","04","00","01","Резерви","040001",0]
[{"$f":"'0'!$A$4","v":"………………"},{"$f":"'0'!$A$2","v":"2020-06-30"},"Т02","12","00","00","Общ финансов резултат",{"$f":"D19&E19&F19","v":"120000"},{"$f":"SUM(I20:I21)","v":0}]
[{"$f":"'0'!$A$4","v":"………………"},{"$f":"'0'!$A$2","v":"2020-06-30"},"Т02","08","00","00","Натрупана печалба (загуба)","080000",0]
{"$rows_left_out":12}
{"sheet":"02","index":2,"n_rows":52,"n_cols":10,"rows_kept":52,"cut":false,"hidden":false,"merged":[]}
[{"$f":"'0'!$A$4","v":"………………"},{"$f":"'0'!$A$2","v":"2020-06-30"},null,{"$f":"\"Т02 РЕКАПИТУЛАЦИЯ НА ЗАДЪЛЖЕНИИЯТА НА \"&'0'!$A$6&\" КЪМ \"&TEXT(B1,\"DD-MM-YYYY\")","v":"Т02 РЕКАПИТУЛАЦИЯ НА ЗАДЪЛЖЕНИИЯТА НА Лечебно заведение КЪМ 30-06-2020"},null,null,{"$f":"\"Т02 РЕКАПИТУЛАЦИЯ НА ЗАДЪЛЖЕНИИЯТА НА \"&'0'!$A$6&\" КЪМ \"&TEXT(B1,\"DD-MM-YYYY\")","v":"Т02 РЕКАПИТУЛАЦИЯ НА ЗАДЪЛЖЕНИИЯТА НА Лечебно заведение КЪМ 30-06-2020"},"Код","Задължения\n (в лева)","От тях просрочени\n(в лева)"]
[{"$f":"'0'!$A$4","v":"………………"},{"$f":"'0'!$A$2","v":"2020-06-30"}]
[{"$f":"'0'!$A$4","v":"………………"},{"$f":"'0'!$A$2","v":"2020-06-30"},"Т04","00","00","01","ОБЩО ЗАДЪЛЖЕНИЯ",{"$f":"D3&E3&F3","v":"000001"},{"$f":"I4+I12","v":0},{"$f":"J4+J12","v":0}]
[{"$f":"'0'!$A$4","v":"………………"},{"$f":"'0'!$A$2","v":"2020-06-30"},"Т04","01","00","00","Нетекущи задължения","010000",{"$f":"SUM(I5:I11)","v":0},{"$f":"SUM(J5:J11)","v":0}]
[{"$f":"'0'!$A$4","v":"………………"},{"$f":"'0'!$A$2","v":"2020-06-30"},"Т04","01","01","00","Пасиви по отсрочени данъци","010100"]
[{"$f":"'0'!$A$4","v":"………………"},{"$f":"'0'!$A$2","v":"2020-06-30"},"Т04","01","02","00","Нетекущи задължения по търговски заеми и финансов лизинг","010200"]
[{"$f":"'0'!$A$4","v":"………………"},{"$f":"'0'!$A$2","v":"2020-06-30"},"Т04","01","03","00","Нетекущи търговски гаранции","010300"]
[{"$f":"'0'!$A$4","v":"………………"},{"$f":"'0'!$A$2","v":"2020-06-30"},"Т04","01","04","00","Дългосрочни банкови заеми","010400"]
[{"$f":"'0'!$A$4","v":"………………"},{"$f":"'0'!$A$2","v":"2020-06-30"},"Т04","01","05","00","Дългосрочни провизии","010500"]
[{"$f":"'0'!$A$4","v":"………………"},{"$f":"'0'!$A$2","v":"2020-06-30"},"Т04","01","06","00","Задължения по договори за предоставяне на субсидия за закупуване на нетекущи активи преди увеличаване на капитала","010600"]
[{"$f":"'0'!$A$4","v":"………………"},{"$f":"'0'!$A$2","v":"2020-06-30"},"Т04","01","07","00","Нетекуща част на финансиранията","010700"]
[{"$f":"'0'!$A$4","v":"………………"},{"$f":"'0'!$A$2","v":"2020-06-30"},"Т04","02","00","00","Текущи задължения","020000",{"$f":"I13+I48+I49+I50+I51+I52","v":0},{"$f":"J13+J48+J49+J50+J51+J52","v":0}]
[{"$f":"'0'!$A$4","v":"………………"},{"$f":"'0'!$A$2","v":"2020-06-30"},"Т04","02","01","00","Общо търговски и други задължения","020100",{"$f":"SUM(I14:I47)","v":0},{"$f":"SUM(J14:J47)","v":0}]
[{"$f":"'0'!$A$4","v":"………………"},{"$f":"'0'!$A$2","v":"2020-06-30"},"Т04","02","01","01","Лекарствени продукти","020101"]
[{"$f":"'0'!$A$4","v":"………………"},{"$f":"'0'!$A$2","v":"2020-06-30"},"Т04","02","01","02","Медицински изделия","020102"]
[{"$f":"'0'!$A$4","v":"………………"},{"$f":"'0'!$A$2","v":"2020-06-30"},"Т04","02","01","03","Кръвни и биопродукти","020103"]
[{"$f":"'0'!$A$4","v":"………………"},{"$f":"'0'!$A$2","v":"2020-06-30"},"Т04","02","01","04","Медицински газове","020104"]
[{"$f":"'0'!$A$4","v":"………………"},{"$f":"'0'!$A$2","v":"2020-06-30"},"Т04","02","01","05","Храна на болни","020105"]
[{"$f":"'0'!$A$4","v":"………………"},{"$f":"'0'!$A$2","v":"2020-06-30"},"Т04","02","01","06","Храна на персонал (Наредба 11)","020106"]
[{"$f":"'0'!$A$4","v":"………………"},{"$f":"'0'!$A$2","v":"2020-06-30"},"Т04","02","01","07","Вода, горива, ел. енергия, топлинна енергия","020107"]
{"$rows_left_out":33}
{"sheet":"03","index":3,"n_rows":52,"n_cols":10,"rows_kept":52,"cut":false,"hidden":false,"merged":[[0,3,0,6]]}
[{"$f":"'0'!$A$4","v":"………………"},{"$f":"'0'!$A$2","v":"2020-06-30"},"Т06",{"$f":"\"Т03 СПРАВКА ЗА ПЕРСОНАЛА НА \"&'0'!A6&\" ОТ \"&TEXT(DATE(YEAR(B1),1,1),\"DD-MM-YYYY\")&\" ДО \"&TEXT(B1,\"DD-MM-YYYY\")","v":"Т03 СПРАВКА ЗА ПЕРСОНАЛА НА Лечебно заведение ОТ 01-01-2020 ДО 30-06-2020"},null,null,null,"Код","Стойност"]
[]
[]
[{"$f":"'0'!$A$4","v":"………………"},{"$f":"'0'!$A$2","v":"2020-06-30"},"Т06","00","00","01","РАЗХОДИ ЗА ВЪЗНАГРАЖДЕНИЯ",{"$f":"D4&E4&F4","v":"000001"},{"$f":"I6+I28+I44","v":0}]
[{"$f":"'0'!$A$4","v":"………………"},{"$f":"'0'!$A$2","v":"2020-06-30"},"Т06","01","00","00","Трудови правоотношения","010000"]
[{"$f":"'0'!$A$4","v":"………………"},{"$f":"'0'!$A$2","v":"2020-06-30"},"Т06","01","01","00","Възнаграждения","010100",{"$f":"SUM(I9:I13)","v":0}]
[{"$f":"'0'!$A$4","v":"………………"},{"$f":"'0'!$A$2","v":"2020-06-30"},"Т06","01","01",1," -от тях с характер на ДМС","01011",0]
[null,"2020-03-31","Т06","01","01",2," -(в т.ч. доп. възнаграждения за работещи в условия на заплаха от COVID-19)","01012",0,"Изплатени допълнителни възнаграждения, финансирани по Оперативна програма „Развитие на човешките ресурси” 2014-2020 г. за подкрепа на работещи в системата на здравеопазването в условия на заплаха за общественото здраве от COVID-19"]
[{"$f":"'0'!$A$4","v":"………………"},{"$f":"'0'!$A$2","v":"2020-06-30"},"Т06","01","01","01","лекари","010101",0]
[{"$f":"'0'!$A$4","v":"………………"},{"$f":"'0'!$A$2","v":"2020-06-30"},"Т06","01","01","04","специалисти по здравни грижи","010104",0]
[{"$f":"'0'!$A$4","v":"………………"},{"$f":"'0'!$A$2","v":"2020-06-30"},"Т06","01","01","05","санитари и болногледачи","010105",0]
[{"$f":"'0'!$A$4","v":"………………"},{"$f":"'0'!$A$2","v":"2020-06-30"},"Т06","01","01","08","друг медицински персонал","010108",0]
[{"$f":"'0'!$A$4","v":"………………"},{"$f":"'0'!$A$2","v":"2020-06-30"},"Т06","01","01","09","немедицински персонал",{"$f":"D13&E13&F13","v":"010109"},0]
[{"$f":"'0'!$A$4","v":"………………"},{"$f":"'0'!$A$2","v":"2020-06-30"},"Т06","01","02","00","Средносписъчен брой на персонала по трудови правоотношения","010200",{"$f":"SUM(I15:I20)","v":0}]
[null,"2020-03-31","Т06","01","02","1","в т.ч. бр. лица, работещи в условия на заплаха от COVID-19","01021",0,"Численост на персонала,  подлежащ на стимулиране съгласно критериите на Оперативна програма „Развитие на човешките ресурси” 2014-2020 г., за подкрепа на работещи в системата на здравеопазването в условия на заплаха за общественото здраве от COVID-19"]
[{"$f":"'0'!$A$4","v":"………………"},{"$f":"'0'!$A$2","v":"2020-06-30"},"Т06","01","02","01","лекари","010201",0]
[{"$f":"'0'!$A$4","v":"………………"},{"$f":"'0'!$A$2","v":"2020-06-30"},"Т06","01","02","04","специалисти по здравни грижи","010204",0]
[{"$f":"'0'!$A$4","v":"………………"},{"$f":"'0'!$A$2","v":"2020-06-30"},"Т06","01","02","05","санитари и болногледачи","010205",0]
[{"$f":"'0'!$A$4","v":"………………"},{"$f":"'0'!$A$2","v":"2020-06-30"},"Т06","01","02","08","друг медицински персонал","010208",0]
[{"$f":"'0'!$A$4","v":"………………"},{"$f":"'0'!$A$2","v":"2020-06-30"},"Т06","01","02","09","немедицински персонал","010209",0]
{"$rows_left_out":33}
{"sheet":"04","index":4,"n_rows":48,"n_cols":10,"rows_kept":48,"cut":false,"hidden":false,"merged":[[0,3,0,6]]}
[null,null,null,{"$f":"\"Т04 МЕДИКОСТАТИСТИЧЕСКИ И ФИНАНСОВИ ПОКАЗАТЕЛИ ЗА ДЕЙНОСТТА НА СТАЦИОНАРА НА \"&'0'!$A$6&\" ОТ \"&TEXT(DATE(YEAR(B3),1,1),\"DD-MM-YYYY\")&\" ДО \"&TEXT(B4,\"DD-MM-YYYY\")","v":"Т04 МЕДИКОСТАТИСТИЧЕСКИ И ФИНАНСОВИ ПОКАЗАТЕЛИ ЗА ДЕЙНОСТТА НА СТАЦИОНАРА НА Лечебно заведение ОТ 01-01-2020 ДО 30-06-2020"},null,null,null,"Код","Стойност"]
[null,null,"1905-07-11"]
[{"$f":"'0'!$A$4","v":"………………"},{"$f":"'0'!$A$2","v":"2020-06-30"},"Т07"]
[{"$f":"'0'!$A$4","v":"………………"},{"$f":"'0'!$A$2","v":"2020-06-30"},"Т07",null,null,null,"Показатели за дейността "]
[{"$f":"'0'!$A$4","v":"………………"},{"$f":"'0'!$A$2","v":"2020-06-30"},"Т07","01","01","00","Брой легла към края на периода",{"$f":"D5&E5&F5","v":"010100"},0]
[{"$f":"'0'!$A$4","v":"………………"},{"$f":"'0'!$A$2","v":"2020-06-30"},"Т07","01","01","1","от тях интензивни","01011",0]
[{"$f":"'0'!$A$4","v":"………………"},{"$f":"'0'!$A$2","v":"2020-06-30"},"Т07","01","02","00","Средномесечен брой легла","010200",0]
[{"$f":"'0'!$A$4","v":"………………"},{"$f":"'0'!$A$2","v":"2020-06-30"},"Т07","01","02","1","от тях интензивни","01021",0]
[{"$f":"'0'!$A$4","v":"………………"},{"$f":"'0'!$A$2","v":"2020-06-30"},"Т07","01","03","00","Брой проведени леглодни","010300",0]
[{"$f":"'0'!$A$4","v":"………………"},{"$f":"'0'!$A$2","v":"2020-06-30"},"Т07","01","04","00","Брой преминали болни","010400",0]
[{"$f":"'0'!$A$4","v":"………………"},{"$f":"'0'!$A$2","v":"2020-06-30"},"Т07","01","04","1","от тях с коронавирус","01041",0]
[{"$f":"'0'!$A$4","v":"………………"},{"$f":"'0'!$A$2","v":"2020-06-30"},"Т07","01","04","01","Пренасочени към друго ЛЗБП","010401",0]
[{"$f":"'0'!$A$4","v":"………………"},{"$f":"'0'!$A$2","v":"2020-06-30"},"Т07","01","05","00","Брой изписани болни","010500",0]
[{"$f":"'0'!$A$4","v":"………………"},{"$f":"'0'!$A$2","v":"2020-06-30"},"Т07","01","06","00","Брой умрели ","010600",0]
[{"$f":"'0'!$A$4","v":"………………"},{"$f":"'0'!$A$2","v":"2020-06-30"},"Т07","01","07","00","Средна продължителност на престоя в дни","010700",{"$f":"IF(I10=0,\"-\",I9/I10)","v":"-"}]
[{"$f":"'0'!$A$4","v":"………………"},{"$f":"'0'!$A$2","v":"2020-06-30"},"Т07","01","08","00","Използваемост на едно легло в дни","010800",{"$f":"IF(I9=0,\"-\",I9/I7)","v":"-"}]
[{"$f":"'0'!$A$4","v":"………………"},{"$f":"'0'!$A$2","v":"2020-06-30"},"Т07","01","09","00","Използваемост на едно легло в %","010900",{"$f":"IF(I9=0,\"-\",I9/((B3-DATE(YEAR(B3),1,1))*I7))","v":"-"}]
[{"$f":"'0'!$A$4","v":"………………"},{"$f":"'0'!$A$2","v":"2020-06-30"},"Т07","01","10","00","Оборот на едно легло","011000",{"$f":"IF(I7=0,\"-\",I10/I7)","v":"-"}]
[{"$f":"'0'!$A$4","v":"………………"},{"$f":"'0'!$A$2","v":"2020-06-30"},"Т07","01","13","00","Леталитет (%)","011300",{"$f":"IF(I10=0,\"-\",I14/I10)","v":"-"}]
[{"$f":"'0'!$A$4","v":"………………"},{"$f":"'0'!$A$2","v":"2020-06-30"},"Т07",null,null,null,"Финансови показатели"]
{"$rows_left_out":29}
{"sheet":"Sheet1","index":5,"n_rows":0,"n_cols":0,"rows_kept":0,"cut":false,"hidden":true,"merged":[]}

{"sheet":"номенклатури","index":6,"n_rows":1021,"n_cols":28,"rows_kept":1021,"cut":false,"hidden":true,"merged":[]}
[null,null,null,null,null,null,null,null,null,"………………","Лечебно заведение"]
["Авиационна медицина",null,"КДБ/регистратура",null,"други",null,"I",null,"2016-12-31","000022025","МБАЛ \"Д-р  Ив.Скендеров\" ЕООД Гоце Делчев",null,null,"Лекарствени продукти",null,null,null,"2017КП001","Стационарни грижи при бременност с повишен риск",390,"КП",null,"Парични еквиваленти",null,"1. Необявена ОП",null,null,"ЕООД"]
["Акушерство и гинекология",null,"КДБ/консултативни кабинети",null,"изследвания",null,"II",null,"2017-12-31","000022044","МБАЛ Разлог ЕООД",null,null,"Медицински изделия",null,null,null,"2017КП002","Пренатална инвазивна диагностика на бременността и интензивни грижи при бременност с реализиран риск",800,"КП",null,"Парични средства в каса",null,"2. В процес ОП",null,null,"ООД"]
["Ангиология",null,"КДБ/лаборатории",null,"операции",null,"III",null,"2018-03-31","101522447","МБАЛ Югозпадна болница ООД Сандански, Петрич",null,null,"Кръвни и биопродукти",null,null,null,"2017КП003","Оперативни процедури за задържане на бременност",128,"КП",null,"УниКредит Булбанк АД",null,"3. Обжалване ОП",null,null,"ЕАД"]
["Анестезиология и интензивно лечение",null,"КДБ/отделения без легла",null,"прегледи",null,null,null,"2018-06-30","102612100","МБАЛ  Карнобат  ЕООД",null,null,"Медицински газове",null,null,null,"2017КП004.1","Преждевременно прекъсване на бременността спонтанно или по медицински показания до 13 гест. с. включително",146,"КП",null,"Банка ДСК EАД",null,"4. Договор ОП в процес",null,null,"АД"]
["Вирусология",null,"КДБ/спешно отделение",null,"диализи",null,null,null,"2018-09-30","102613775","МБАЛ Айтос  ЕООД",null,null,"Храна на болни",null,null,null,"2017КП004.2","Преждевременно прекъсване на бременността спонтанно или по медицински показания от 14 гест. с. до 26 г.с. на плода",230,"КП",null,"Обединена българска банка АД",null,"5. Договор ОП приключил",null,null,"ДЗЗД"]
["Вътрешни болести",null,"Стационар/клиника с легла/отделение с легла",null,"анестезии",null,null,null,"2018-12-31","102618523","МБАЛ Поморие  ЕООД",null,null,"Храна на персонал (Наредба 11)",null,null,null,"2017КП005","Раждане",580,"КП",null,"Юробанк България АД"]
["Гастроентерология",null,"Стационар/клиника с легла/отделение без легла",null,"манипулации",null,null,null,"2019-03-31","102663909","МБАЛ Средец  ЕООД",null,null,"Вода, горива, ел. енергия, топлинна енергия",null,null,null,"2017КП006","Грижи за здраво новородено дете",160,"КП",null,"Райфайзенбанк (България) ЕАД"]
["Гериатрична медицина",null,"Стационар/клиника без легла",null,null,null,null,null,"2019-06-30","000090033","МБАЛ  \"Царица Йоанна\" ЕООД Провадия",null,null,"Резервни части и доокомплектовка на апаратура",null,null,null,"2017КП007","Диагностика и лечение на новородени с тегло над 2500 грама, първа степен на тежест",800,"КП",null,"Сосиете Женерал Експресбанк АД"]
["Гръдна хирургия",null,"Стационар/отделение без легла",null,null,"от СРЗ","до СРЗ","макс МРЗ","2019-09-30","000092550","МБАЛ  Девня ЕООД",null,null,"Медицински принадлежности",null,null,null,"2017КП008","Диагностика и лечение на новородени с тегло над 2500 грама, втора степен на тежест",1200,"КП",null,"Алианц Банк България АД"]
["Детска гастроентерология",null,"Стационар/отделение с легла",null,"Изпълнителен директор",2.8,4,12,"2019-12-31","104508837","МБАЛ  Павликени  ЕООД  ",null,null,"Хигиенни материали",null,null,null,"2017КП009","Диагностика и лечение на новородени с тегло от 1500 до 2499 грама, първа степен на тежест",900,"КП",null,"Банка Пиреос България АД"]
["Детска ендокринология и болести на обмяната",null,"Стационар/операционни зали",null,"Член на СД",2,2,5,"2020-03-31","104509202","МБАЛ \"Д-р Димитър Павлович\" ЕООД   Свищов",null,null,"Канцеларски материали",null,null,null,"2017КП010","Диагностика и лечение на новородени с тегло от 1500 до 2499 грама, втора степен на тежест",1300,"КП",null,"Ти Би Ай Банк EАД"]
["Детска кардиология",null,"АСБ/административни звена",null,"Председател на СД",2,2,5,"2020-06-30","104512579","МБАЛ \"Св. Иван Рилски\" ЕООД - Горна Оряховица",null,null,"Работно облекло и постелен инвентар",null,null,null,"2017КП011","Диагностика и лечение на новородени с тегло под 1499 грама",3600,"КП",null,"Първа инвестиционна банка АД"]
["Детска клинична хематология и онкология",null,"АСБ/стопански звена",null,"Зам. председател на СД",2,2,5,"2020-09-30","105515375","МБАЛ \"Проф. д-р Г. Златарски\" ЕООД Белоградчик",null,null,"Други материали",null,null,null,"2017КП012","Диагностика и лечение на дете c вродени аномалии",1200,"КП",null,"СИБАНК EАД"]
["Детска неврология",null,"АСБ/обслужващи звена",null,"Прокурист ",2.8,4,12,"2020-12-31","106510388","МБАЛ \"Св. Иван Рилски\" ЕООД Козлодуй ",null,null,"Текущ ремонт на сграден фонд",null,null,null,"2017КП013","Диагностика и интензивно лечение на новородени с дихателна недостатъчност, първа степен на тежест",2000,"КП",null,"Търговска банка Виктория ЕАД"]
["Детска нефрология и хемодиализа",null,null,null,"Управител",2.8,4,12,"2021-03-31","106512909","МБАЛ Мездра ЕООД",null,null,"Текущ ремонт на апаратура и оборудване",null,null,null,"2017КП014","Диагностика и интензивно лечение на новородени с дихателна недостатъчност, втора степен на тежест",3200,"КП",null,"Българо - американска кредитна банка АД"]
["Детска пневмология и фтизиатрия",null,null,null,"Контрольор ",2,2,4,"2021-06-30","106513498","МБАЛ Бяла Слатина  ЕООД",null,null,"Поддръжка на оборудване и софтуер",null,null,null,"2017КП015.1","Диагностика и интензивно лечение на новородени с еднократно приложение на сърфактант, независимо от теглото",3300,"КП",null,"ПроКредит Банк (България) EАД"]
["Детска психиатрия",null,null,null,null,null,null,null,"2021-09-30","107505537","МБАЛ \"Д-р Теодоси Витанов\" ЕООД Трявна",null,null,"Наети активи",null,null,null,"2017КП015.2","Диагностика и интензивно лечение на новородени с многократно приложение на сърфактант, независимо от теглото",5600,"КП",null,"Търговска Банка Д АД"]
["Детска ревматология",null,null,null,null,null,null,null,"2021-12-31","107507982","МБАЛ \"Д-р Стойчо Христов\" ЕООД Севлиево",null,null,"Медицински услуги",null,null,null,"2017КП016","Диагностика и лечение на нестабилна форма на ангина пекторис/остър миокарден инфаркт без инвазивно изследване и/или интервенционално лечение",200,"КП",null,"Токуда Банк АД"]
["Детска хирургия",null,null,null,null,null,null,null,null,"124142404","МБАЛ Каварна ЕООД ",null,null,"Транспорт",null,null,null,"2017КП017","Инвазивна диагностика при сърдечно-съдови заболявания",750,"КП",null,"Инвестбанк АД"]
{"$rows_left_out":1002}
{"sheet":"Sheet3","index":7,"n_rows":0,"n_cols":0,"rows_kept":0,"cut":false,"hidden":true,"merged":[]}